{"text_format":"1","workbook":"xlsx","n_sheets":3,"sheets":["SIMULADOR","Dados","BASE DE CÁLCULO IRRF E PREV."],"not_rendered":{"charts":0,"images":1,"macros":1,"external_links":1,"defined_names":4,"comments":0,"pivot_tables":0},"unopened":[],"bounds":{"document_bytes":16777216,"sheet_cells":100000,"rows_first":2000,"rows_last":500,"rows_between":2000,"halvings":0,"cell_chars":16384,"cell_head_chars":4096},"cells_cut":0,"cells_raw":0,"read":"whole","date_system":"1900"}

{"sheet":"SIMULADOR","index":0,"n_rows":32,"n_cols":12,"rows_kept":32,"cut":false,"hidden":false,"merged":[[5,11,5,12],[0,0,1,12],[3,5,3,6],[3,8,3,9],[3,11,3,12],[4,11,4,12],[30,1,30,2],[15,5,15,6],[6,11,6,12],[7,11,9,12],[10,11,10,12],[11,11,29,12],[15,0,15,2],[20,1,20,2],[23,8,24,9],[25,1,25,2],[26,5,27,6]]}
[]
[]
[]
["CÓDIGO","DESCRIÇÃO","OBSERVAÇÃO","VALOR",null,"DESCONTOS OBRIGATÓRIOS",null,null,"DESCONTOS FACULTATIVOS",null,null,"AVALIAÇÃO DE VERBAS "]
[142,{"$f":"IFERROR(VLOOKUP(A5,Dados!$A:$F,2,0),\"\")","v":"Piso Salarial"},{"$f":"IFERROR(VLOOKUP(A5,Dados!$A:$F,4,0),\"\")","v":"Acatar"},8000,null,"IMPOSTO DE RENDA",null,null,"EMPRÉSTIMO CONSIGNADO",null,null,"CONSULTA CÓDIGO"]
[3029,{"$f":"IFERROR(VLOOKUP(A6,Dados!$A:$F,2,0),\"\")","v":"Artigo 133 Ce – Pró-Labore LC 1193/2013"},{"$f":"IFERROR(VLOOKUP(A6,Dados!$A:$F,4,0),\"\")","v":"Não Acatar"},null,null,"CONTR. PREV.",null,null,"EMPRÉSTIMO CONSIGNADO"]
[null,{"$f":"IFERROR(VLOOKUP(A7,Dados!$A:$F,2,0),\"\")","v":""},{"$f":"IFERROR(VLOOKUP(A7,Dados!$A:$F,4,0),\"\")","v":""},null,null,"PENSÃO ALIMENT.",null,null,"EMPRÉSTIMO CONSIGNADO",null,null,"DESCRIÇÃO DA VERBA "]
[null,{"$f":"IFERROR(VLOOKUP(A8,Dados!$A:$F,2,0),\"\")","v":""},{"$f":"IFERROR(VLOOKUP(A8,Dados!$A:$F,4,0),\"\")","v":""},null,null,"IAMSPE",null,null,"FARMÁCIA",null,null,{"$f":"IFERROR(VLOOKUP(L6,Dados!$A:$B,2,0),\"\")","v":""}]
[null,{"$f":"IFERROR(VLOOKUP(A9,Dados!$A:$F,2,0),\"\")","v":""},{"$f":"IFERROR(VLOOKUP(A9,Dados!$A:$F,4,0),\"\")","v":""},null,null,"ACSPM",null,null,"SUPERMERCADO"]
[null,{"$f":"IFERROR(VLOOKUP(A10,Dados!$A:$F,2,0),\"\")","v":""},{"$f":"IFERROR(VLOOKUP(A10,Dados!$A:$F,4,0),\"\")","v":""},null,null,"ADEPOM",null,null,"SEG. VIDA"]
[null,{"$f":"IFERROR(VLOOKUP(A11,Dados!$A:$F,2,0),\"\")","v":""},{"$f":"IFERROR(VLOOKUP(A11,Dados!$A:$F,4,0),\"\")","v":""},null,null,"FEPOM",null,null,"AGEPOL",null,null,"OBSERVAÇÃO"]
[null,{"$f":"IFERROR(VLOOKUP(A12,Dados!$A:$F,2,0),\"\")","v":""},{"$f":"IFERROR(VLOOKUP(A12,Dados!$A:$F,4,0),\"\")","v":""},null,null,"CBPM",null,null,"SIFUSPESP",null,null,{"$f":"IFERROR(VLOOKUP(L6,Dados!$A:$F,6,0),\"\")","v":""}]
[null,{"$f":"IFERROR(VLOOKUP(A13,Dados!$A:$F,2,0),\"\")","v":""},{"$f":"IFERROR(VLOOKUP(A13,Dados!$A:$F,4,0),\"\")","v":""},null,null,"OUTROS",null,null,"ASS. FUNERAL"]
[null,{"$f":"IFERROR(VLOOKUP(A14,Dados!$A:$F,2,0),\"\")","v":""},{"$f":"IFERROR(VLOOKUP(A14,Dados!$A:$F,4,0),\"\")","v":""},null,null,"TOTAL [",{"$f":"SUM(G5:G13)","v":0},null,"APAS"]
[null,{"$f":"IFERROR(VLOOKUP(A15,Dados!$A:$F,2,0),\"\")","v":""},{"$f":"IFERROR(VLOOKUP(A15,Dados!$A:$F,4,0),\"\")","v":""},null,null,null,null,null,"APEOESP"]
["TOTAL [",null,null,{"$f":"SUM(D5:D15)","v":8000},null,"DADOS DA MARGEM CONSIGNAVEL",null,null,"ASSOSSIAÇÕES DIVERSAS"]
[null,null,null,null,null,"SALDO (Verbas Fixas - Desc. Obrig.)",{"$f":"D16-G14","v":8000},null,"OUTROS"]
[null,"% DO CALCULO PREVIDENCIÁRIO A SER UTILIZADO",{"$f":"IF($D$16<=1212,\"11%\",IF($D$16<=3473.74,\"12%\",IF($D$16<=7087.22,\"14%\",IF($D$16>7087.22,\"16%\"))))","v":"16%"},null,null,"MARGEM CONSIGNÁVEL TOTAL BRUTA 30%",{"$f":"G17*30%","v":2400},null,"TOTAL [",{"$f":"SUM(J5:J17)","v":0}]
[null,"CÁLCULO FINAL DA PREVIDENCIA ",{"$f":"D16*C18","v":1280},null,null,"MARGEM CONSIGNÁVEL TOTAL BRUTA 35%",{"$f":"G17*35%","v":2800}]
[null,"CÁLCULO FINAL DA PREVIDENCIA MILITARES 10,5%",{"$f":"IFERROR(D16*10.5%,\"\")","v":840},null,null,"Comprometimento Compulsórios",{"$f":"IFERROR((G14)/D16,\"\")","v":0},null,"INSERIR A PARCELA DE CARTÃO ]"]
[null,"REGRA - BASE PREVIDÊNCIA**",null,null,null,"Comprometimento Facultativos",{"$f":"IFERROR((J18)/D16,\"\")","v":0},null,null,{"$f":"SUM(J8:J16)","v":0}]
[null,"ATÉ 1 SALÁRIO MINIMO - R$ 1.518,00",0.11,null,null,"Comprometimento TOTAL",{"$f":"SUM(G20:G21)","v":0},null,"PREENCHER A QUANTIDADE DE DEPENDENTES  ["]
[null,"R$ 1.518,01 ATÉ R$ 4.022,46",0.12,null,null,"MARGEM DISPONÍVEL TOTAL 5% (100% da Margem)",{"$f":"G17*5%-J20","v":400},null,"VALOR DE DEDUÇÃO PELA QTDE. DE DEPENDENTES [",{"$f":"(J22*189.59)","v":0}]
[null,"R$ 4.022,47 ATÉ R$ 8.157,41",0.14000000000000001,null,null,"MARGEM DISPONÍVEL TOTAL 15% (100% da Margem)",{"$f":"G17*15%-J21","v":1200},null,"CÁLCULO DO I.R.R.F. (proporcional a verbas fixas)"]
[null,"ACIMA R$ 8.157,41",0.16,null,null,"MARGEM DISPONÍVEL TOTAL 30% (100% da Margem)",{"$f":"G18-J18","v":2400}]
[null,"CALCULO DA PREVIDÊNCIA - SPPREV",null,null,null,"MARGEM DISPONÍVEL TOTAL 35% (100% da Margem)",{"$f":"G19-J18","v":2800},null,"Base de Cálculo do I.R.R.F.",{"$f":"IF(J30=\"NÃO\",D16-J23,IF(J30=\"SIM\",(D16-(J31+J23)),\"0\"))","v":7435.2}]
[null,"ATÉ 1 SALÁRIO MINIMO - R$ 1.518,00 -  11%",{"$f":"IFERROR(IF(AND($D$16<'BASE DE CÁLCULO IRRF E PREV.'!A23),$D$16*'BASE DE CÁLCULO IRRF E PREV.'!C22,0),0)","v":0},null,null,{"$f":"IF(G26>=0,\"AVERBAR, MARGEM POSITIVA\",\"NÃO AVERBAR, MARGEM NEGATIVA\")","v":"AVERBAR, MARGEM POSITIVA"},null,null,"I.R.R.F. BASE",{"$f":"IF($J$26<='BASE DE CÁLCULO IRRF E PREV.'!$B$3,$J$26*'BASE DE CÁLCULO IRRF E PREV.'!C3,IF($J$26<='BASE DE CÁLCULO IRRF E PREV.'!$B$4,$J$26*'BASE DE CÁLCULO IRRF E PREV.'!$C$4,IF($J$26<='BASE DE CÁLCULO IRRF E PREV.'!$B$5,$J$26*'BASE DE CÁLCULO IRRF E PREV.'!C5,IF($J$26<='BASE DE CÁLCULO IRRF E PREV.'!$B$6,$J$26*'BASE DE CÁLCULO IRRF E PREV.'!C6,IF($J$26>'BASE DE CÁLCULO IRRF E PREV.'!$B$6,$J$26*'BASE DE CÁLCULO IRRF E PREV.'!C7,\"\")))))","v":2044.68}]
[null,"R$ 1.518,01 ATÉ R$ 4.022,46 - Previdência 12%",{"$f":"IF(AND($D$16>'BASE DE CÁLCULO IRRF E PREV.'!B22,$D$16<'BASE DE CÁLCULO IRRF E PREV.'!A24),($D$16-J32)*'BASE DE CÁLCULO IRRF E PREV.'!C23,0)","v":0},null,null,null,null,null,"VALOR DA DEDUÇÃO",{"$f":"IF($J$26<='BASE DE CÁLCULO IRRF E PREV.'!B3,'BASE DE CÁLCULO IRRF E PREV.'!$D$3,IF($J$26<='BASE DE CÁLCULO IRRF E PREV.'!$B$4,'BASE DE CÁLCULO IRRF E PREV.'!$D$4,IF($J$26<='BASE DE CÁLCULO IRRF E PREV.'!$B$5,'BASE DE CÁLCULO IRRF E PREV.'!$D$5,IF($J$26<='BASE DE CÁLCULO IRRF E PREV.'!$B$6,'BASE DE CÁLCULO IRRF E PREV.'!$D$6,IF($J$26>'BASE DE CÁLCULO IRRF E PREV.'!$B$6,'BASE DE CÁLCULO IRRF E PREV.'!D7)))))","v":896}]
[null,"R$ 4.022,47 ATÉ R$ 8.157,41 - Previdência 14%",{"$f":"IF(AND($D$16>'BASE DE CÁLCULO IRRF E PREV.'!B23,$D$16<'BASE DE CÁLCULO IRRF E PREV.'!A25),($D$16-J32)*'BASE DE CÁLCULO IRRF E PREV.'!C24,0)","v":907.48000000000013},null,null,null,null,null,"VALOR FINAL DO I.R.R.F. [",{"$f":"J27-J28","v":1148.68}]
[null,"ACIMA R$ 8.157,41  -  Previdência 16%",{"$f":"IF(AND($D$16>'BASE DE CÁLCULO IRRF E PREV.'!B24),($D$16-J32)*'BASE DE CÁLCULO IRRF E PREV.'!C25,0)","v":0},null,null,null,null,null,"APLICA O DESCONTO SIMPLIFICADO DE R$ 564,80 ]","sim"]
[null,"*** UTILIZAR SOMENTE PARA APOSENTADOS COM DESCONTO DE PREVIDÊNCIA",null,null,null,null,null,null,null,564.79999999999995]
[null,null,null,null,null,null,null,null,null,1518]

{"sheet":"Dados","index":1,"n_rows":2230,"n_cols":6,"rows_kept":2230,"cut":false,"hidden":false,"merged":[]}
["Código","Denominação","Publicação no Diário Oficial","observação","LEI","informação Complementar"]
[142,"Piso Salarial",null,"Acatar"]
[1001,"Salário Base","Comunicado DDP/G-05, de 31/01/1994 => DOE: 01/02/1994","Acatar"]
[1002,"Salário Base Proporcional","Comunicado DDP/G-05, de 31/01/1994 => DOE: 01/02/1994","Não Acatar"]
[1003,"Salário Base Estagiário","Comunicado DDP/G-05, de 31/01/1994 => DOE: 01/02/1994","Não Acatar"]
[1004,"Salário Base Implantado","Comunicado DDP/G-05, de 31/01/1994 => DOE: 01/02/1994","Acatar"]
[1005,"Salário Complemento  LC 729/93 E 801/95","Comunicado DDP/G-05, de 31/01/1994 => DOE: 01/02/1994","Avaliar","LC 729/93 E 801/95","Somente para Engenheiros,  O servidor regido pela Consolidação das Leis do Trabalho, ocupante de função-atividade pertencente as séries de classes de Engenheiro, Arquiteto, Engenheiro Agrônomo e Assistente Agropecuário "]
[1006,"Subsídios Governardor / Vice Governardor","Comunicado DDP/G-05, de 31/01/1994 => DOE: 01/02/1994","Não Acatar"]
[1007,"Piso Salarial – Reajuste Complementar","Comunicado DDP/G-05, de 31/01/1994 => DOE: 01/02/1994","Acatar"]
[1008,"Salário Maternidade","Comunicado DDP/G-15, de 30/09/2016 => DOE: 01/10/2016","Não Acatar"]
[1009,"Piso Salarial - Contratado","Comunicado DDP/G-05, de 31/01/1994 => DOE: 01/02/1994","Não Acatar"]
[1010,"Piso Salarial - Perda De Gratificação De Representação","Comunicado DDP/G-05, de 31/01/1994 => DOE: 01/02/1994","Não Acatar"]
[1011,"Salário Complemento - Técnico De Laboratório","Comunicado DDP/G-15, de 30/09/2016 => DOE: 01/10/2016","Acatar"]
[1012,"Salário Complemento - Técnico De Radiologia","Comunicado DDP/G-15, de 30/09/2016 => DOE: 01/10/2016","Acatar"]
[1013,"Salário Complemento - Cirurgião Dentista","Comunicado DDP/G-15, de 30/09/2016 => DOE: 01/10/2016","Acatar"]
[1014,"Salário Complemento - Méd.Veterinário/Químico","Comunicado DDP/G-15, de 30/09/2016 => DOE: 01/10/2016","Acatar"]
[1015,"Salário Complemento - Engenheiro - Salário Mínimo","Comunicado DDP/G-15, de 30/09/2016 => DOE: 01/10/2016","Acatar"]
[1016,"Diferença De Jornada - Técnico de Laboratório","Comunicado DDP/G-15, de 30/09/2016 => DOE: 01/10/2016","Acatar"]
[1017,"Complementação De Piso - Docente","Comunicado DDP/G-05, de 02/02/1995 => DOE: 03/02/1995","Acatar"]
[1018,"Complementação Piso - Substituição Docente/ Res. -212/95 - Recuperação","Comunicado DDP/G-05, de 02/02/1995 => DOE: 03/02/1995","Acatar"]
[1019,"Complementação De Piso – Especialista Da Educação","Comunicado DDP/G-13, de 30/05/1995 => DOE: 01/06/1995","Não Acatar"]
[1020,"Piso Salarial - Perda Do Prêmio De Incentivo À Produtividade E Qualidade","Comunicado DDP/G-43, de 04/11/1998 => DOE: 06/11/1998","Avaliar",null,"Para os atuais servidores que vierem a se aposentar a partir da data de vigência desta lei complementar, com direito a proventos calculados com base na remuneração do cargo efetivo ou função-atividade em que se der a aposentadoria, o PIPQ será computado no respectivo cálculo à razão de 1/30 (um trinta avos), por ano de recebimento."]
[1021,"Abono Complementar Proporcional / Guarda Rodoviário","Comunicado DDP/G-08, de 11/04/2000 => DOE: 13/04/2000","Não Acatar"]
[1022,"Piso  - Perda De Gratificações","Comunicado DDP/G-33, de 31/08/2000 => DOE: 02/09/2000","Não Acatar"]
[1023,"Padrão Do Estado / CBPM ","Comunicado DDP/G-07, de 31/01/2002 => DOE: 02/02/2002","Acatar"]
[1024,"Abono Complementar Agente De Escolta E Vigilância Penitenciária","Comunicado DDP/G-22, de 15/08/2002 => DOE: 17/08/2002","Avaliar",null,"todos os efeitos legais.\n§ 2º - O valor desta gratificação será computado no\ncálculo do décimo terceiro salário, nos termos do\nartigo 1º da Lei Complementar nº 644, de 26 de\ndezembro de 1989, e no cálculo do acréscimo de 1/3 (um\nterço) das férias, não podendo ser considerado para\ncálculo de quaisquer outras vantagens pecuniárias.\n§ 3º - Sobre o valor da Gratificação por Atividade de\nEscolta e Vigilância – GAEV, incidirão os descontos\nprevidenciários e de assistência médica devidos.\nArtigo 13 – O servidor que passar à inatividade, terá\na Gratificação por Atividade de Escolta e Vigilância –\nGAEV, computada no cálculo de seus proventos, na base\nde 1/60 (um sessenta avos) para cada mês em que, no\nperíodo dos 60 (sessenta) meses imediatamente\nanteriores"]
[1025,"Auxílio Mensal – SD PM Temporário","Comunicado DDP/G-22, de 15/08/2002 => DOE: 17/08/2002","Não Acatar"]
[1026,"Benefício Previdenciário","Comunicado DDPE/G-13, de 07/04/2005 => DOE: 09/04/2005","Avaliar",null,"Verificar se verba compõe a base prividenciária"]
[1027,"Salário Complemento - 1 Salário Mínimo","Comunicado DDPE/G-17, de 28/07/2006 => DOE: 29/07/2006","Acatar"]
[1028,"Complemento Auxílio Previdenciário - Quadro Especial","Comunicado DDPE/G-17, de 28/07/2006 => DOE: 29/07/2006","Avaliar",null,"Verificar se verba compõe a base prividenciária"]
[1029,"Subsídio Secretário De Estado","Comunicado DDPE/G-13, de 14/05/2007 => DOE: 15/05/2007","Acatar"]
[1030,"Valor Base LC 1059/08 – Agente Fiscal De Rendas","Comunicado DDPE/G-04, de 22/06/2012 => DOE: 27/06/2012","Avaliar","Artigo 15 - A remuneração do Agente Fiscal de Rendas compreende:I - como parte fixa, o valor-base, expresso em quantidade de quotas, conforme o nível em que estiver enquadrado, constante do Anexo desta lei complementar;\nII - como parte variável:\na) o prêmio de produtividade;\nb) outras que vierem a ser previstas em lei;\nIII - como vantagens pecuniárias:\na) o adicional por tempo de serviço, de que trata o artigo 129, calculado à razão de 5% (cinco por cento) por qüinqüênio de serviço, sobre o valor da parte fixa, acrescido do prêmio de produtividade e do “pro labore”, observado o disposto no inciso XVI do artigo 115, ambos da Constituição Estadual;\nb) a sexta-parte, de que trata o artigo 129 da Constituição Estadual, calculada sobre o valor da parte fixa, acrescido do prêmio de produtividade, do “pro labore” e do adicional por tempo de serviço;\nc) décimo terceiro salário;\nd) acréscimo de 1/3 (um terço) das férias;\ne) “pro labore”;\nf) adicional de transporte como ajuda de custo para indenizar despesas de locomoção;\ng) verba indenizatória pelo exercício em unidades localizadas nas divisas do Estado;\nh) diárias;\ni) gratificação de representação, de que trata o inciso III do artigo 135 da Lei nº 10.261, de 28 de outubro de 1968. ","Verificar se verba compõe a base prividenciária"]
[1031,"Benefício Previdenciário – SPPREV","Comunicado DDPE/G-04, de 22/06/2012 => DOE: 27/06/2012","Acatar"]
[1032,"Salário Complemento - Médicos LC 1193/2013","Comunicado DDP/G-003, de 27/10/2014 => DOE: 29/10/2014","Acatar"]
[1033,"Saldo De Benefício","Comunicado DDP/G-14, de 28/09/2016 => DOE: 29/09/2016","Não Acatar"]
[1034,"Benefício Previdenciário Pensão - São Paulo Previdência","Comunicado DDP/G-14, de 28/09/2016 => DOE: 29/09/2016","Avaliar",null,"Verificar se verba compõe a base prividenciária"]
[1035,"Piso Salarial Docente - Decreto 62500/2017","Comunicado DDP/G-03, de 14/06/2018 => DOE: 15/06/2018","Acatar"]
[1036,"Piso Salarial Docente-Substituição Docente/ Aulas De Recuperacao / Reposicao / Vice Diretor ","Comunicado DDP/G-03, de 14/06/2018 => DOE: 15/06/2018","Não Acatar"]
[1037,"Benefício Previdenciário – Teto RGPS","Comunicado DDP/G-05, de 03/07/2020 => DOE: 04/07/2020","Acatar"]
[1040,"Salário Base - LC1374/22-Subsidio",null,"Acatar","LC1374/22-Subsidio","SEM OBSERVAÇÕES "]
[1041,"Piso Sal Nac Enfermagem Ent Descent",null,"Acatar"]
[1046,"Subsidio Policial Penal LC 1416/24",null,"Acatar","LEI COMPLEMENTAR N° 1.416, DE 26 DE SETEMBRO DE 2024","Artigo 3° - Para efeitos desta lei complementar são adotadas as seguintes definições:  \nI - cargo de policial penal: conjunto de atribuições e responsabilidades conferidas ao policial penal;  \nII - carreira de policial penal: estrutura composta por cargos de provimento efetivo de policial penal e respectivos níveis;  \nIII - evolução: forma de avanço nos níveis da carreira mediante aferição de desempenho e de desenvolvimento;  \nIV - categoria: elemento alfabético indicativo da posição do policial penal no respectivo nível;  \nV - nível: elemento numérico indicativo da posição do policial penal na escala de evolução funcional;  \nVI - subsídio: contraprestação pecuniária fixada em lei, paga mensalmente pelo efetivo exercício do cargo de policial penal.  "]
[2001,"Carga Suplementar / Horária - Professor I","Comunicado DDP/G-05, de 31/01/1994 => DOE: 01/02/1994","Não Acatar"]
[2002,"Carga Suplementar / Horária - Professor II","Comunicado DDP/G-05, de 31/01/1994 => DOE: 01/02/1994","Não Acatar"]
[2003,"Carga Suplementar / Horária - Professor III","Comunicado DDP/G-05, de 31/01/1994 => DOE: 01/02/1994","Não Acatar"]
[2004,"Carga Suplementar – Média / Inativo Disponibilidade","Comunicado DDP/G-05, de 31/01/1994 => DOE: 01/02/1994","Não Acatar"]
[2005,"Carga Suplementar - Média Readaptado","Comunicado DDP/G-05, de 31/01/1994 => DOE: 01/02/1994","Não Acatar"]
[2006,"Aulas Excedentes – Conservatório Musical Tatuí","Comunicado DDP/G-05, de 31/01/1994 => DOE: 01/02/1994","Não Acatar"]
[2007,"Aulas – Inativo – Conservatório Musical Tatuí","Comunicado DDP/G-05, de 31/01/1994 => DOE: 01/02/1994","Avaliar",null,"Verificar se verba compõe a base prividenciária"]
[2008,"Gratificação Trabalho Curso Noturno – Escola Padrão - Professor I - 30%","Comunicado DDP/G-05, de 31/01/1994 => DOE: 01/02/1994","Não Acatar"]
[2009,"Gratificação Trabalho Curso Noturno – Escola Padrão - Professor II - 30%","Comunicado DDP/G-05, de 31/01/1994 => DOE: 01/02/1994","Não Acatar"]
[2010,"Gratificação  Trabalho Curso Noturno –Escola Padrão -  Professor III - 30%","Comunicado DDP/G-05, de 31/01/1994 => DOE: 01/02/1994","Não Acatar"]
[2011,"Gratificação Trabalho Curso Noturno – Professor I - 20%","Comunicado DDP/G-05, de 31/01/1994 => DOE: 01/02/1994","Não Acatar"]
[2012,"Gratificação Trabalho Curso Noturno - Professor II - 20%","Comunicado DDP/G-05, de 31/01/1994 => DOE: 01/02/1994","Não Acatar"]
[2013,"Gratificação Trabalho Curso Noturno – Professor III - 20%","Comunicado DDP/G-05, de 31/01/1994 => DOE: 01/02/1994","Não Acatar"]
[2014,"Serviço Extraordinário – Professor I","Comunicado DDP/G-05, de 31/01/1994 => DOE: 01/02/1994","Não Acatar"]
[2015,"Serviço Extraordinário – Professor II","Comunicado DDP/G-05, de 31/01/1994 => DOE: 01/02/1994","Não Acatar"]
[2016,"Serviço Extraordinário – Professor III","Comunicado DDP/G-05, de 31/01/1994 => DOE: 01/02/1994","Não Acatar"]
[2017,"Substituição Docente – Professor I","Comunicado DDP/G-05, de 31/01/1994 => DOE: 01/02/1994","Não Acatar"]
[2018,"Substituição Docente – Professor II","Comunicado DDP/G-05, de 31/01/1994 => DOE: 01/02/1994","Não Acatar"]
[2019,"Substituição Docente – Professor III","Comunicado DDP/G-05, de 31/01/1994 => DOE: 01/02/1994","Não Acatar"]
[2020,"Substituição Docente - Estagiário","Comunicado DDP/G-05, de 31/01/1994 => DOE: 01/02/1994","Não Acatar"]
[2021,"Substituição Docente – Gratificação Trabalho Curso Noturno – Professor I - 20%","Comunicado DDP/G-05, de 31/01/1994 => DOE: 01/02/1994","Não Acatar"]
[2022,"Substituição Docente – Gratificação Trabalho Curso  Noturno – Professor II - 20%","Comunicado DDP/G-05, de 31/01/1994 => DOE: 01/02/1994","Não Acatar"]
[2023,"Substituição Docente – Gratificação Trabalho Curso Noturno – Professor III - 20%","Comunicado DDP/G-05, de 31/01/1994 => DOE: 01/02/1994","Não Acatar"]
[2024,"Substituição Docente – Gratificação Curso Noturno – Professor I - 30%","Comunicado DDP/G-05, de 31/01/1994 => DOE: 01/02/1994","Não Acatar"]
[2025,"Substituição Docente – Gratificação Curso Noturno – Professor II - 30%","Comunicado DDP/G-05, de 31/01/1994 => DOE: 01/02/1994","Não Acatar"]
[2026,"Substituição Docente – Gratificação Curso Noturno – Professor III - 30%","Comunicado DDP/G-25, de 13/09/1995 => DOE: 14/09/1995","Não Acatar"]
[2027,"Aulas – Alteração Cargo / Padrão","Comunicado DDP/G-25, de 13/09/1995 => DOE: 14/09/1995","Não Acatar"]
[2028,"Carga Horária - Docente - Resolução 212/95","Comunicado DDP/G-25, de 13/09/1995 => DOE: 14/09/1995","Não Acatar"]
[2029,"Gratificação Trabalho Curso Noturno - 30% - Resolução 212/95","Comunicado DDP/G-25, de 13/09/1995 => DOE: 14/09/1995","Não Acatar"]
[2030,"Gratificação Trabalho Curso Noturno - 20% - Resolução 212/95","Comunicado DDP/G-24, de 06/05/1996 => DOE: 09/05/1996","Não Acatar"]
[2031,"Adicional Local De Exercício - Docente - Resolução 212/95","Comunicado DDP/G-24, de 06/05/1996 => DOE: 09/05/1996","Não Acatar"]
[2032,"Prêmio De Valorização – Quadro Do Magistério","Comunicado DDP/G-24, de 06/05/1996 => DOE: 09/05/1996","Avaliar","Programa de Valorização pelo Mérito garante evolução na carreira: Uma política inédita implantada pela Secretaria da Educação permite que os educadores paulistas evoluam na carreira a partir de oito níveis de progressão salarial com intervalos de três anos e aumentos de 10,5% sobre o salário, o que também amplia os valores das vantagens financeiras adquiridas durante a vida funcional.\n\nPara isso, os profissionais participam de uma prova, realizada anualmente, na qual todos os que atingirem determinadas metas de avaliação, a serem estabelecidas, conquistam a evolução na carreira. As avaliações são destinadas a professores, diretores de escola, assistentes de diretor, supervisores de ensino e coordenadores pedagógicos efetivos ou estáveis.\n\nAlém da avaliação aplicada em todas as 91 Diretorias de Ensino, são exigidos outros critérios para participar do processo, como tempo de atuação contínuo de pelo menos quatro anos no mesmo cargo e assiduidade.\n\nDesde 2010, o Programa de Valorização pelo Mérito já promoveu 127 mil docentes de todo o Estado. Os docentes promovidos devem esperar um intervalo mínimo de três anos para concorrer em novo processo. https://www.educacao.sp.gov.br/valorizacao","Verificar se verba compõe a base prividenciária"]
[2033,"Prêmio De Valorização – Quadro De Apoio Escolar / Quadro Secretaria Educação","Comunicado DDP/G-34, de 01/07/1996 => DOE: 03/07/1996","Avaliar","Programa de Valorização pelo Mérito garante evolução na carreira: Uma política inédita implantada pela Secretaria da Educação permite que os educadores paulistas evoluam na carreira a partir de oito níveis de progressão salarial com intervalos de três anos e aumentos de 10,5% sobre o salário, o que também amplia os valores das vantagens financeiras adquiridas durante a vida funcional.\n\nPara isso, os profissionais participam de uma prova, realizada anualmente, na qual todos os que atingirem determinadas metas de avaliação, a serem estabelecidas, conquistam a evolução na carreira. As avaliações são destinadas a professores, diretores de escola, assistentes de diretor, supervisores de ensino e coordenadores pedagógicos efetivos ou estáveis.\n\nAlém da avaliação aplicada em todas as 91 Diretorias de Ensino, são exigidos outros critérios para participar do processo, como tempo de atuação contínuo de pelo menos quatro anos no mesmo cargo e assiduidade.\n\nDesde 2010, o Programa de Valorização pelo Mérito já promoveu 127 mil docentes de todo o Estado. Os docentes promovidos devem esperar um intervalo mínimo de três anos para concorrer em novo processo. https://www.educacao.sp.gov.br/valorizacao","Verificar se verba compõe a base prividenciária"]
[2034,"Prêmio De Valorização – Substituição Docente/ Reposição/ Recuperação","Comunicado DDP/G-34, de 01/07/1996 => DOE: 03/07/1996","Avaliar",null,"Verificar se verba compõe a base prividenciária"]
[2035,"Aulas Reforço / Recuperação – 1 A 4 Série","Comunicado DDP/G-34, de 01/07/1996 => DOE: 03/07/1996","Não Acatar"]
[2036,"Aulas Reforço / Recuperação – 5 A 8 Série","Comunicado DDP/G-34, de 01/07/1996 => DOE: 03/07/1996","Não Acatar"]
[2037,"Aulas Reforço / Recuperação – Ensino Médio","Comunicado DDP/G-34, de 01/07/1996 => DOE: 03/07/1996","Não Acatar"]
[2038,"Gratificação Trabalho Curso Noturno - Aulas Reforço / Recuperação – 1 A 4 ","Comunicado DDP/G-34, de 01/07/1996 => DOE: 03/07/1996","Não Acatar"]
{"$rows_left_out":2151}
{"sheet":"BASE DE CÁLCULO IRRF E PREV.","index":2,"n_rows":26,"n_cols":4,"rows_kept":26,"cut":false,"hidden":false,"merged":[[0,0,0,1],[7,0,7,3],[9,0,9,3],[19,0,19,3]]}
["Base de cálculo (em R$)",null,"Alíquota (%)","Parcela a deduzir (em R$)"]
["DE","ATÉ","%","DEDUÇÃO"]
[0,2259.1999999999998,0,0]
[2259.21,2826.65,7.4999999999999997E-2,169.44]
[2826.66,3751.05,0.15,381.44]
[3751.06,4664.68,0.22500000000000001,662.77]
[4664.6899999999996,100000,0.27500000000000002,896]
["Valor da Dedução por dependente 2024: R$ 189,59"]
["fonte:  https://www.gov.br/receitafederal/pt-br/assuntos/meu-imposto-de-renda/tabelas/2024"]
["Tabela de Contribuição do INSS / PREVIDÊNCIA ATUAL"]
["DE","ATÉ","ALÍQUOTA","CONTRIBUIÇÃO MÁXIMA"]
[0,1518,7.4999999999999997E-2,951.53]
[1518.01,2793.88,0.09]
[2793.89,4190.83,0.12]
[4190.84,8157.41,0.14000000000000001]
[]
["PERCENTUAL","VALOR"]
[{"$f":"IF('[1]Simulador de margem'!G4<='BASE DE CÁLCULO IRRF E PREV.'!B12,'BASE DE CÁLCULO IRRF E PREV.'!C12,IF('[1]Simulador de margem'!G4<='BASE DE CÁLCULO IRRF E PREV.'!B13,'BASE DE CÁLCULO IRRF E PREV.'!C13,IF('[1]Simulador de margem'!G4<='BASE DE CÁLCULO IRRF E PREV.'!B15,'BASE DE CÁLCULO IRRF E PREV.'!C15,'BASE DE CÁLCULO IRRF E PREV.'!C15)))","v":7.4999999999999997E-2},{"$f":"IF('[1]Simulador de margem'!G4*A18<'BASE DE CÁLCULO IRRF E PREV.'!D12,'[1]Simulador de margem'!G4*A18,'[1]Simulador de margem'!H129)","v":0}]
[]
["Tabela de Contribuição Previdenciária dos Aposentados e Pensionistas de SP"]
["DE","ATÉ","ALÍQUOTA","CONTRIBUIÇÃO MÁXIMA"]
[0,1518,0.11]
[1518.01,4022.46,0.12]
[{"$f":"B23+0.01","v":4022.4700000000003},8157.41,0.14000000000000001]
[{"$f":"B24+0.01","v":8157.42},100000,0.16]
["https://www.apatej.org.br/portaria-da-spprev-estabelece-aliquotas-de-contribuicao-previdenciaria-para-servidores/"]